Target
Melatonin receptor type 1A
Ligand
BDBM50140305
Substrate
Meas. Tech.
ChEBML_105100
Ki
0.200000±n/a nM
Citation
 Sun, LQChen, JTakaki, KJohnson, GIben, LMahle, CDRyan, EXu, C Design and synthesis of benzoxazole derivatives as novel melatoninergic ligands. Bioorg Med Chem Lett 14:1197-200 (2004)  
Target
Name:
Melatonin receptor type 1A
Synonyms:
MTNR1A MTR1A_HUMAN Mel1a melatonin receptor Melatonin receptor Melatonin receptor type 1 (MT1) | Melatonin receptor type 1A
Type:
Enzyme
Mol. Mass.:
39392.94
Organism:
Homo sapiens (Human)
Description:
P48039
Residue:
350
  
Inhibitor
Name:
BDBM50140305
Synonyms:
CHEMBL431103 | N-[(1R,2R)-2-(2-Ethyl-2,3-dihydro-benzooxazol-7-yl)-cyclopropylmethyl]-isobutyramide
Type:
Small organic molecule
Emp. Form.:
C17H24N2O2
Mol. Mass.:
288.3847
SMILES:
CCC1Nc2cccc([C@@H]3C[C@H]3CNC(=O)C(C)C)c2O1
: