Target
Beta-lactamase
Ligand
BDBM50140669
Substrate
Meas. Tech.
ChEBML_197644
IC50
1400±n/a nM
Citation
 Buynak, JDChen, HVogeti, LGadhachanda, VRBuchanan, CAPalzkill, TShaw, RWSpencer, JWalsh, TR Penicillin-derived inhibitors that simultaneously target both metallo- and serine-beta-lactamases. Bioorg Med Chem Lett 14:1299-304 (2004)  
Target
Name:
Beta-lactamase
Synonyms:
AMPC_ECOLI Beta-lactamase (AmpC) Cephalosporinase ampA | ampC
Type:
Protien
Mol. Mass.:
41561.62
Organism:
Escherichia coli
Description:
P00811
Residue:
377
  
Inhibitor
Name:
BDBM50140669
Synonyms:
(2S,5R,6S)-6-Mercapto-3,3-dimethyl-4,4,7-trioxo-4lambda*6*-thia-1-aza-bicyclo[3.2.0]heptane-2-carboxylic acid | CHEMBL26275
Type:
Small organic molecule
Emp. Form.:
C8H11NO5S2
Mol. Mass.:
265.307
SMILES:
CC1(C)[C@@H](N2[C@@H]([C@@H](S)C2=O)S1(=O)=O)C(O)=O
: