Target
Metallo-beta-lactamase type 2
Ligand
BDBM50076678
Substrate
Meas. Tech.
ChEBML_104646
IC50
>200000±n/a nM
Citation
 Buynak, JDChen, HVogeti, LGadhachanda, VRBuchanan, CAPalzkill, TShaw, RWSpencer, JWalsh, TR Penicillin-derived inhibitors that simultaneously target both metallo- and serine-beta-lactamases. Bioorg Med Chem Lett 14:1299-304 (2004)  
Target
Name:
Metallo-beta-lactamase type 2
Synonyms:
BLAB_BACCE Metallo-beta-lactamase domain-containing protein 2 | Metallo-beta-lactamase superfamily protein
Type:
PROTEIN
Mol. Mass.:
28044.00
Organism:
Bacillus cereus
Description:
ChEMBL_104097
Residue:
256
  
Inhibitor
Name:
BDBM50076678
Synonyms:
(2S,5R,6R)-6-Hydroxymethyl-3,3-dimethyl-4,4,7-trioxo-4lambda*6*-thia-1-aza-bicyclo[3.2.0]heptane-2-carboxylic acid CHEMBL416561
Type:
Small organic molecule
Emp. Form.:
C9H13NO6S
Mol. Mass.:
263.268
SMILES:
CC1(C)[C@@H](N2[C@@H]([C@H](CO)C2=O)S1(=O)=O)C(O)=O
: