Target
Multidrug resistance-associated protein 1
Ligand
BDBM50140835
Substrate
Meas. Tech.
ChEMBL_103771 (CHEMBL714751)
IC50
11±n/a nM
Citation
 Wang, SWan, NCHarrison, JMiller, WChuckowree, ISohal, SHancox, TCBaker, SFolkes, AWilson, FThompson, DCocks, SFarmer, HBoyce, AFreathy, CBroadbridge, JScott, JDepledge, PFaint, RMistry, PCharlton, P Design and synthesis of new templates derived from pyrrolopyrimidine as selective multidrug-resistance-associated protein inhibitors in multidrug resistance. J Med Chem 47:1339-50 (2004)  
Target
Name:
Multidrug resistance-associated protein 1
Synonyms:
7.6.2.2 ABCC1 ATP-binding cassette, sub-family C, member 1 isoform 1 LTC4 transporter MRP MRP1_HUMAN
Type:
Mol. Mass.:
171597.72
Organism:
Homo sapiens (Human)
Description:
P33527
Residue:
1531
  
Inhibitor
Name:
BDBM50140835
Synonyms:
8-{4-[2-(3,4-Difluoro-phenyl)-ethyl]-piperazin-1-yl}-2,9-dimethyl-3-nitro-9H-1,5,7,9-tetraaza-fluorene-4-carboxylic acid amide | CHEMBL26779
Type:
Small organic molecule
Emp. Form.:
C24H24F2N8O3
Mol. Mass.:
510.496
SMILES:
Cc1nc2n(C)c3c(ncnc3c2c(C(N)=O)c1[N+]([O-])=O)N1CCN(CCc2ccc(F)c(F)c2)CC1
: