Target
Retinoic acid receptor RXR-alpha
Ligand
BDBM50141590
Substrate
Meas. Tech.
ChEMBL_196920 (CHEMBL807382)
Ki
6±n/a nM
Citation
 Michellys, PYD'Arrigo, JGrese, TAKaranewsky, DSLeibowitz, MDMais, DAMapes, CMReifel-Miller, ARungta, DBoehm, MF Design, synthesis and structure-activity relationship of novel RXR-selective modulators. Bioorg Med Chem Lett 14:1593-8 (2004)  
Target
Name:
Retinoic acid receptor RXR-alpha
Synonyms:
NR2B1 Nuclear receptor subfamily 4 group A member 2 RXRA Retinoic acid receptor RXR-alpha/gamma Retinoid receptor
Type:
PROTEIN
Mol. Mass.:
50820.38
Organism:
Homo sapiens (Human)
Description:
ChEMBL_1456363
Residue:
462
  
Inhibitor
Name:
BDBM50141590
Synonyms:
(E)-3-[4-(2-Ethoxy-3,5-diisopropyl-phenyl)-benzo[b]thiophen-2-yl]-but-2-enoic acid | CHEMBL41890
Type:
Small organic molecule
Emp. Form.:
C26H30O3S
Mol. Mass.:
422.58
SMILES:
CCOc1c(cc(cc1-c1cccc2sc(cc12)C(\C)=C\C(O)=O)C(C)C)C(C)C
: