Target
Retinoic acid receptor RXR-beta
Ligand
BDBM50141589
Substrate
Meas. Tech.
ChEBML_196588
Ki
>10000±n/a nM
Citation
 Michellys, PYD'Arrigo, JGrese, TAKaranewsky, DSLeibowitz, MDMais, DAMapes, CMReifel-Miller, ARungta, DBoehm, MF Design, synthesis and structure-activity relationship of novel RXR-selective modulators. Bioorg Med Chem Lett 14:1593-8 (2004)  
Target
Name:
Retinoic acid receptor RXR-beta
Synonyms:
Nr2b2 Retinoid X receptor beta | Rxrb
Type:
PROTEIN
Mol. Mass.:
55877.78
Organism:
Mus musculus
Description:
ChEMBL_196588
Residue:
520
  
Inhibitor
Name:
BDBM50141589
Synonyms:
(Z)-3-[7-(2-Butoxy-3,5-diisopropyl-phenyl)-benzofuran-2-yl]-2-fluoro-but-2-enoic acid | CHEMBL290246
Type:
Small organic molecule
Emp. Form.:
C28H33FO4
Mol. Mass.:
452.5576
SMILES:
CCCCOc1c(cc(cc1-c1cccc2cc(oc12)C(\C)=C(/F)C(O)=O)C(C)C)C(C)C
: