Target
Retinoic acid receptor alpha
Ligand
BDBM50141601
Substrate
Meas. Tech.
ChEBML_196468
Ki
>10000±n/a nM
Citation
 Michellys, PYD'Arrigo, JGrese, TAKaranewsky, DSLeibowitz, MDMais, DAMapes, CMReifel-Miller, ARungta, DBoehm, MF Design, synthesis and structure-activity relationship of novel RXR-selective modulators. Bioorg Med Chem Lett 14:1593-8 (2004)  
Target
Name:
Retinoic acid receptor alpha
Synonyms:
NR1B1 RAR-alpha RARA_HUMAN Retinoic acid receptor alpha/Retinoid X receptor alpha Retinoid receptor
Type:
PROTEIN
Mol. Mass.:
50778.87
Organism:
Homo sapiens (Human)
Description:
ChEMBL_1466191
Residue:
462
  
Inhibitor
Name:
BDBM50141601
Synonyms:
(E)-3-[7-(2-Ethoxy-3,5-diisopropyl-phenyl)-benzofuran-2-yl]-but-2-enoic acid | CHEMBL289057
Type:
Small organic molecule
Emp. Form.:
C26H30O4
Mol. Mass.:
406.514
SMILES:
CCOc1c(cc(cc1-c1cccc2cc(oc12)C(\C)=C\C(O)=O)C(C)C)C(C)C
: