Target
Alpha-1D adrenergic receptor
Ligand
BDBM50143720
Substrate
Meas. Tech.
ChEMBL_32721 (CHEMBL645993)
Ki
0.41±n/a nM
Citation
 Leonardi, ABarlocco, DMontesano, FCignarella, GMotta, GTesta, RPoggesi, ESeeber, MDe Benedetti, PGFanelli, F Synthesis, screening, and molecular modeling of new potent and selective antagonists at the alpha 1d adrenergic receptor. J Med Chem 47:1900-18 (2004)  
Target
Name:
Alpha-1D adrenergic receptor
Synonyms:
ADA1D_RAT Adra1d Alpha-1D adrenergic receptor | Serotonin 1a (5-HT1a) receptor/Adrenergic receptor alpha-1
Type:
Protein
Mol. Mass.:
59375.97
Organism:
Rattus norvegicus (Rat)
Description:
P23944
Residue:
561
  
Inhibitor
Name:
BDBM50143720
Synonyms:
8-{2-[4-(2,5-Dichloro-phenyl)-piperazin-1-yl]-1-methyl-ethyl}-8-aza-spiro[4.5]decane-7,9-dione | CHEMBL300152
Type:
Small organic molecule
Emp. Form.:
C22H29Cl2N3O2
Mol. Mass.:
438.391
SMILES:
CC(CN1CCN(CC1)c1cc(Cl)ccc1Cl)N1C(=O)CC2(CCCC2)CC1=O
: