Target
Estrogen receptor
Ligand
BDBM50146269
Substrate
Meas. Tech.
ChEMBL_67363 (CHEMBL873603)
IC50
0.510000±n/a nM
Citation
 Kim, SWu, JChen, HYBirzin, ETChan, WYang, YTColwell, LLi, SDahllund, JDiNinno, FRohrer, SPSchaeffer, JMHammond, ML Estrogen receptor ligands. Part 4: The SAR of the syn-dihydrobenzoxathiin SERAMs. Bioorg Med Chem Lett 14:2741-5 (2004)  
Target
Name:
Estrogen receptor
Synonyms:
ER ESR ESR1_HUMAN Estrogen receptor Estrogen receptor (ER-alpha) Estrogen receptor alpha (ER) Nuclear receptor subfamily 3 group A member 1
Type:
Protein
Mol. Mass.:
66230.44
Organism:
Homo sapiens (Human)
Description:
P03372
Residue:
595
  
Inhibitor
Name:
BDBM50146269
Synonyms:
(2R,3S)-5-Chloro-3-(4-hydroxy-phenyl)-2-[4-(2-piperidin-1-yl-ethoxy)-phenyl]-2,3-dihydro-benzo[1,4]oxathiin-7-ol | CHEMBL94116
Type:
Small organic molecule
Emp. Form.:
C27H28ClNO4S
Mol. Mass.:
498.034
SMILES:
Oc1ccc(cc1)[C@@H]1Sc2c(Cl)cc(O)cc2O[C@@H]1c1ccc(OCCN2CCCCC2)cc1
: