Target
Adenosine receptor A2a
Ligand
BDBM50147645
Substrate
Meas. Tech.
ChEBML_31364
Ki
44±n/a nM
Citation
 Guba, WNettekoven, MPüllmann, BRiemer, CSchmitt, S Comparison of inhibitory activity of isomeric triazolopyridine derivatives towards adenosine receptor subtypes or do similar structures reveal similar bioactivities? Bioorg Med Chem Lett 14:3307-12 (2004)  
Target
Name:
Adenosine receptor A2a
Synonyms:
A2A adenosine receptor (hA2A) ADENOSINE A2 ADORA2 Adenosine A2A receptor (A2AAR)
Type:
G Protein-Coupled Receptor (GPCR)
Mol. Mass.:
44716.46
Organism:
Homo sapiens (Human)
Description:
P29274
Residue:
412
  
Inhibitor
Name:
BDBM50147645
Synonyms:
8-Amino-2-(5-bromo-furan-2-yl)-[1,2,4]triazolo[1,5-a]pyridine-6-carboxylic acid methyl-propyl-amide | CHEMBL113009
Type:
Small organic molecule
Emp. Form.:
C15H16BrN5O2
Mol. Mass.:
378.224
SMILES:
CCCN(C)C(=O)c1cc(N)c2nc(nn2c1)-c1ccc(Br)o1
: