Target
Reverse transcriptase/RNaseH
Ligand
BDBM50011181
Substrate
Meas. Tech.
ChEMBL_196375 (CHEMBL802547)
IC50
56000±n/a nM
Citation
 Velázquez, SLobatón, EDe Clercq, EKoontz, DLMellors, JWBalzarini, JCamarasa, MJ Hybrids of [TSAO-T]-[foscarnet]: The first conjugate of foscarnet with a non-nucleoside reverse transcriptase inhibitor through a labile covalent ester bond. J Med Chem 47:3418-26 (2004)  
Target
Name:
Reverse transcriptase/RNaseH
Synonyms:
HIV-1 Reverse Transcriptase RNase H Reverse transcriptase/RNaseH
Type:
PROTEIN
Mol. Mass.:
65229.15
Organism:
Human immunodeficiency virus 1
Description:
ChEMBL_1473730
Residue:
566
  
Inhibitor
Name:
BDBM50011181
Synonyms:
(PFA)dihydroxyphosphinecarboxylic acid oxide FOSCARNET Foscarnet (PFA) Phosphono-formic acid(PFA) dihydroxyphosphinecarboxylic acid oxide phosphonoformic acid(PFA)
Type:
Small organic molecule
Emp. Form.:
CH3O5P
Mol. Mass.:
126.0053
SMILES:
OC(=O)P(O)(O)=O
: