Target
Dihydrofolate reductase
Ligand
BDBM18268
Substrate
Meas. Tech.
ChEMBL_54085 (CHEMBL669982)
IC50
1.5±n/a nM
Citation
 Gangjee, ALin, XQueener, SF Design, synthesis, and biological evaluation of 2,4-diamino-5-methyl-6-substituted-pyrrolo[2,3-d]pyrimidines as dihydrofolate reductase inhibitors. J Med Chem 47:3689-92 (2004)  
Target
Name:
Dihydrofolate reductase
Synonyms:
Dihydrofolate reductase (DHFR) | Tetrahydrofolate dehydrogenase
Type:
Enzyme
Mol. Mass.:
19884.75
Organism:
Mycobacterium avium
Description:
Recombinant Mycobacterium avium DHFR expressed in E. coli.
Residue:
181
  
Inhibitor
Name:
BDBM18268
Synonyms:
5-methyl-6-{[(3,4,5-trimethoxyphenyl)amino]methyl}quinazoline-2,4-diamine TMQ US11111252, Compound TMQ | US11530198, Example Trimetrexate
Type:
Small organic molecule
Emp. Form.:
C19H23N5O3
Mol. Mass.:
369.4176
SMILES:
COc1cc(NCc2ccc3nc(N)nc(N)c3c2C)cc(OC)c1OC
: