Target
17beta-hydroxysteroid dehydrogenase
Ligand
BDBM50149607
Substrate
Meas. Tech.
ChEMBL_306374 (CHEMBL828716)
IC50
8000±n/a nM
Citation
 Gobec, SSova, MKristan, KRizner, TL Cinnamic acid esters as potent inhibitors of fungal 17beta-hydroxysteroid dehydrogenase--a model enzyme of the short-chain dehydrogenase/reductase superfamily. Bioorg Med Chem Lett 14:3933-6 (2004)  
Target
Name:
17beta-hydroxysteroid dehydrogenase
Synonyms:
17-beta-hydroxysteroid-dehydrogenase
Type:
PROTEIN
Mol. Mass.:
28901.23
Organism:
Curvularia lunata
Description:
ChEMBL_306373
Residue:
270
  
Inhibitor
Name:
BDBM50149607
Synonyms:
2-Oxo-2H-chromene-3-carboxylic acid benzyl ester coumarin-3-carboxylic acid benzyl ester
Type:
Small organic molecule
Emp. Form.:
C17H12O4
Mol. Mass.:
280.2748
SMILES:
O=C(OCc1ccccc1)c1cc2ccccc2oc1=O
: