Target
RNA-directed RNA polymerase
Ligand
BDBM50150368
Substrate
Meas. Tech.
ChEMBL_305746 (CHEMBL829418)
IC50
910±n/a nM
Citation
 Gopalsamy, ALim, KEllingboe, JWKrishnamurthy, GOrlowski, MFeld, Bvan Zeijl, MHowe, AY Identification of [(naphthalene-1-carbonyl)-amino]-acetic acid derivatives as nonnucleoside inhibitors of HCV NS5B RNA dependent RNA polymerase. Bioorg Med Chem Lett 14:4221-4 (2004)  
Target
Name:
RNA-directed RNA polymerase
Synonyms:
Hepatitis C virus NS5B RNA-dependent RNA polymerase | NS5B protein
Type:
Protein
Mol. Mass.:
25173.95
Organism:
Hepatitis C virus
Description:
Q8JXU8
Residue:
229
  
Inhibitor
Name:
BDBM50150368
Synonyms:
2-[(2-Bromo-6-methoxy-5-trifluoromethyl-naphthalene-1-carbonyl)-amino]-succinic acid | CHEMBL361657
Type:
Small organic molecule
Emp. Form.:
C17H13BrF3NO6
Mol. Mass.:
464.187
SMILES:
COc1ccc2c(C(=O)NC(CC(O)=O)C(O)=O)c(Br)ccc2c1C(F)(F)F
: