Target
5-hydroxytryptamine receptor 7
Ligand
BDBM50150423
Substrate
Meas. Tech.
ChEMBL_302554 (CHEMBL839517)
Ki
5±n/a nM
Citation
 Denhart, DJPurandare, AVCatt, JDKing, HDGao, ADeskus, JAPoss, MAStark, ADTorrente, JRJohnson, GMattson, RJ Diaminopyrimidine and diaminopyridine 5-HT7 ligands. Bioorg Med Chem Lett 14:4249-52 (2004)  
Target
Name:
5-hydroxytryptamine receptor 7
Synonyms:
5-HT-7 5-HT7 5-HT7S 5HT7 HTR7 | Serotonin receptor 7
Type:
G Protein-Coupled Receptor (GPCR)
Mol. Mass.:
53573.08
Organism:
Homo sapiens (Human)
Description:
P34969
Residue:
479
  
Inhibitor
Name:
BDBM50150423
Synonyms:
CHEMBL182680 | N-[2-(4-Fluoro-phenyl)-ethyl]-N''-((S)-1-phenyl-ethyl)-pyrimidine-4,6-diamine
Type:
Small organic molecule
Emp. Form.:
C20H21FN4
Mol. Mass.:
336.4059
SMILES:
C[C@H](Nc1cc(NCCc2ccc(F)cc2)ncn1)c1ccccc1
: