Target
5-hydroxytryptamine receptor 7
Ligand
BDBM50150442
Substrate
Meas. Tech.
ChEMBL_302554 (CHEMBL839517)
Ki
6±n/a nM
Citation
 Denhart, DJPurandare, AVCatt, JDKing, HDGao, ADeskus, JAPoss, MAStark, ADTorrente, JRJohnson, GMattson, RJ Diaminopyrimidine and diaminopyridine 5-HT7 ligands. Bioorg Med Chem Lett 14:4249-52 (2004)  
Target
Name:
5-hydroxytryptamine receptor 7
Synonyms:
5-HT-7 5-HT7 5-HT7S 5HT7 HTR7 | Serotonin receptor 7
Type:
G Protein-Coupled Receptor (GPCR)
Mol. Mass.:
53573.08
Organism:
Homo sapiens (Human)
Description:
P34969
Residue:
479
  
Inhibitor
Name:
BDBM50150442
Synonyms:
CHEMBL182070 | N*4*-Phenethyl-N*2*-(1-phenyl-ethyl)-pyrimidine-2,4-diamine
Type:
Small organic molecule
Emp. Form.:
C20H22N4
Mol. Mass.:
318.4155
SMILES:
CC(Nc1nccc(NCCc2ccccc2)n1)c1ccccc1
: