Target
5-hydroxytryptamine receptor 7
Ligand
BDBM50125260
Substrate
Meas. Tech.
ChEMBL_303365 (CHEMBL839683)
Ki
2.24±n/a nM
Citation
 Holmberg, PSohn, DLeideborg, RCaldirola, PZlatoidsky, PHanson, SMohell, NRosqvist, SNordvall, GJohansson, AMJohansson, R Novel 2-aminotetralin and 3-aminochroman derivatives as selective serotonin 5-HT7 receptor agonists and antagonists. J Med Chem 47:3927-30 (2004)  
Target
Name:
5-hydroxytryptamine receptor 7
Synonyms:
5-HT-7 5-HT7 5-HT7S 5-hydroxytryptamine receptor 7 5HT7R_RAT GPRFO Serotonin (5-HT) receptor | Serotonin Receptor 7
Type:
G Protein-Coupled Receptor (GPCR)
Mol. Mass.:
49852.62
Organism:
Rattus norvegicus (rat)
Description:
Rat cloned 5-HT7R.
Residue:
448
  
Inhibitor
Name:
BDBM50125260
Synonyms:
2-{2-[4-(5-Fluoro-2-oxo-2,3-dihydro-benzoimidazol-1-yl)-piperidin-1-yl]-ethyl}-2,3,4,5-tetrahydro-benzo[c]azepin-1-one | CHEMBL273921
Type:
Small organic molecule
Emp. Form.:
C24H27FN4O2
Mol. Mass.:
422.4952
SMILES:
Fc1ccc2n(C3CCN(CCN4CCCc5ccccc5C4=O)CC3)c(=O)[nH]c2c1
: