Target
Aldo-keto reductase family 1 member B1
Ligand
BDBM16512
Substrate
Meas. Tech.
ChEMBL_306565 (CHEMBL829140)
IC50
30±n/a nM
Citation
 El-Kabbani, ODarmanin, COka, MSchulze-Briese, CTomizaki, THazemann, IMitschler, APodjarny, A High-resolution structures of human aldose reductase holoenzyme in complex with stereoisomers of the potent inhibitor Fidarestat: stereospecific interaction between the enzyme and a cyclic imide type inhibitor. J Med Chem 47:4530-7 (2004)  
Target
Name:
Aldo-keto reductase family 1 member B1
Synonyms:
AKR1B1 ALDR_HUMAN AR Aldose Reductase (ALR2) Aldose reductase (AR)
Type:
Protein
Mol. Mass.:
35855.50
Organism:
Homo sapiens (Human)
Description:
P15121. 4LAU; 2IKI; 4LB4; 2FZD; 2FZ8; 1US0
Residue:
316
  
Inhibitor
Name:
BDBM16512
Synonyms:
(2S,4S)-6-fluoro-2',5'-dioxo-2,3-dihydrospiro[1-benzopyran-4,4'-imidazolidine]-2-carboxamide CHEMBL84446 Fidarestat (1)
Type:
Small organic molecule
Emp. Form.:
C12H10FN3O4
Mol. Mass.:
279.2239
SMILES:
NC(=O)[C@@H]1C[C@]2(NC(=O)NC2=O)c2cc(F)ccc2O1
: