Target
5-hydroxytryptamine receptor 1B
Ligand
BDBM50021809
Substrate
Meas. Tech.
ChEMBL_302366 (CHEMBL829547)
Ki
1980±n/a nM
Citation
 Prisinzano, TDukat, MLaw, HSlassi, AMacLean, NDeLannoy, IGlennon, RA 2-(Anilino)imidazolines and 2-(benzyl)imidazoline derivatives as h5-HT1D serotonin receptor ligands. Bioorg Med Chem Lett 14:4697-9 (2004)  
Target
Name:
5-hydroxytryptamine receptor 1B
Synonyms:
5-HT-1B 5-HT1B 5HT1B_HUMAN HTR1DB Serotonin (5-HT) receptor Serotonin Receptor 1B
Type:
G Protein-Coupled Receptor (GPCR)
Mol. Mass.:
43579.17
Organism:
Homo sapiens (Human)
Description:
Receptor binding assays were performed using human clone stably expressed in CHO cells
Residue:
390
  
Inhibitor
Name:
BDBM50021809
Synonyms:
(2,6-Dichloro-4-iodo-phenyl)-(4,5-dihydro-1H-imidazol-2-yl)-amine CHEMBL360803 | p-iodoclonidine
Type:
Small organic molecule
Emp. Form.:
C9H8Cl2IN3
Mol. Mass.:
355.99
SMILES:
Clc1cc(I)cc(Cl)c1\[#7]=[#6]-1\[#7]-[#6]-[#6]-[#7]-1
: