Target
Procathepsin L
Ligand
BDBM50153291
Substrate
Meas. Tech.
ChEMBL_304971 (CHEMBL829304)
IC50
>250000±n/a nM
Citation
 Chircorian, ABarrios, AM Inhibition of lysosomal cysteine proteases by chrysotherapeutic compounds: a possible mechanism for the antiarthritic activity of Au(I). Bioorg Med Chem Lett 14:5113-6 (2004)  
Target
Name:
Procathepsin L
Synonyms:
CATL1_HUMAN CTSL CTSL1 Cathepsin L Cathepsin L1 heavy chain MEP cathepsin L preproprotein
Type:
Enzyme
Mol. Mass.:
37557.19
Organism:
Homo sapiens (Human)
Description:
Purchased from Calbiochem (San Diego, CA).
Residue:
333
  
Inhibitor
Name:
BDBM50153291
Synonyms:
(1-Thio-beta-D-glucopyranosato)(triethylphosphine)gold2,3,4,6-tetraacetate CHEMBL1366 SK&F-39162 | SK-39162
Type:
Small organic molecule
Emp. Form.:
C20H34AuO9PS
Mol. Mass.:
678.484
SMILES:
CC[P+](CC)(CC)[Au-]S[C@@H]1O[C@H](COC(C)=O)[C@@H](OC(C)=O)[C@H](OC(C)=O)[C@H]1OC(C)=O
: