Target
Carbonic anhydrase 1
Ligand
BDBM26987
Substrate
Meas. Tech.
ChEMBL_302606 (CHEMBL839656)
Ki
15000000±n/a nM
Citation
 Rusconi, SInnocenti, AVullo, DMastrolorenzo, AScozzafava, ASupuran, CT Carbonic anhydrase inhibitors. Interaction of isozymes I, II, IV, V, and IX with phosphates, carbamoyl phosphate, and the phosphonate antiviral drug foscarnet. Bioorg Med Chem Lett 14:5763-7 (2004)  
Target
Name:
Carbonic anhydrase 1
Synonyms:
CA-I CAB Carbonate dehydratase I Carbonic anhydrase 1 (CA I) Carbonic anhydrase 1 (Recombinant CA I) Carbonic anhydrase B Carbonic anhydrase I (CA I) Carbonic anhydrase I (CAI) Carbonic anhydrase isoenzyme I (hCA I) | hCA
Type:
Enzyme
Mol. Mass.:
28873.37
Organism:
Homo sapiens (Human)
Description:
P00915
Residue:
261
  
Inhibitor
Name:
BDBM26987
Synonyms:
CHEMBL180485 SODIUM CARBONATE carbonate ion
Type:
Ion
Emp. Form.:
CO3
Mol. Mass.:
60.01
SMILES:
[O-]C([O-])=O
: