Target
Carbonic anhydrase 1
Ligand
BDBM50155537
Substrate
Meas. Tech.
ChEMBL_302606 (CHEMBL839656)
Ki
780000.0±n/a nM
Citation
 Rusconi, SInnocenti, AVullo, DMastrolorenzo, AScozzafava, ASupuran, CT Carbonic anhydrase inhibitors. Interaction of isozymes I, II, IV, V, and IX with phosphates, carbamoyl phosphate, and the phosphonate antiviral drug foscarnet. Bioorg Med Chem Lett 14:5763-7 (2004)  
Target
Name:
Carbonic anhydrase 1
Synonyms:
CA-I CAB Carbonate dehydratase I Carbonic anhydrase 1 (CA I) Carbonic anhydrase 1 (Recombinant CA I) Carbonic anhydrase B Carbonic anhydrase I (CA I) Carbonic anhydrase I (CAI) Carbonic anhydrase isoenzyme I (hCA I) | hCA
Type:
Enzyme
Mol. Mass.:
28873.37
Organism:
Homo sapiens (Human)
Description:
P00915
Residue:
261
  
Inhibitor
Name:
BDBM50155537
Synonyms:
CHEMBL363100 Trinatriumphosphat sodium orthophosphate sodium phosphate, tribasic tertiary sodium phosphate tribasic sodium phosphate
Type:
Small organic molecule
Emp. Form.:
O4P
Mol. Mass.:
94.973
SMILES:
[O-]P([O-])([O-])=O
: