Target
Carbonic anhydrase 2
Ligand
BDBM50155537
Substrate
Meas. Tech.
ChEMBL_302635 (CHEMBL839926)
Ki
530000±n/a nM
Citation
 Rusconi, SInnocenti, AVullo, DMastrolorenzo, AScozzafava, ASupuran, CT Carbonic anhydrase inhibitors. Interaction of isozymes I, II, IV, V, and IX with phosphates, carbamoyl phosphate, and the phosphonate antiviral drug foscarnet. Bioorg Med Chem Lett 14:5763-7 (2004)  
Target
Name:
Carbonic anhydrase 2
Synonyms:
CA-II CAC Carbonate dehydratase II Carbonic anhydrase 2 (CA-II) Carbonic anhydrase C Carbonic anhydrase II (CA-II) Carbonic anhydrase II (hCA II) | Carbonic anhydrase isoenzyme II (hCA II)
Type:
Enzyme
Mol. Mass.:
29250.71
Organism:
Homo sapiens (Human)
Description:
P00918
Residue:
260
  
Inhibitor
Name:
BDBM50155537
Synonyms:
CHEMBL363100 Trinatriumphosphat sodium orthophosphate sodium phosphate, tribasic tertiary sodium phosphate tribasic sodium phosphate
Type:
Small organic molecule
Emp. Form.:
O4P
Mol. Mass.:
94.973
SMILES:
[O-]P([O-])([O-])=O
: