Target
Glutathione reductase, mitochondrial
Ligand
BDBM50096018
Substrate
Meas. Tech.
ChEMBL_306715 (CHEMBL832300)
IC50
2700±n/a nM
Citation
 Biot, CBauer, HSchirmer, RHDavioud-Charvet, E 5-substituted tetrazoles as bioisosteres of carboxylic acids. Bioisosterism and mechanistic studies on glutathione reductase inhibitors as antimalarials. J Med Chem 47:5972-83 (2004)  
Target
Name:
Glutathione reductase, mitochondrial
Synonyms:
GLUR GSHR_HUMAN Glutathione reductase | Glutathione reductase (GR)
Type:
Enzyme
Mol. Mass.:
56271.52
Organism:
Homo sapiens (Human)
Description:
P00390
Residue:
522
  
Inhibitor
Name:
BDBM50096018
Synonyms:
6-(3-METHYL-1,4-DIOXO-1,4-DIHYDRONAPHTHALEN-2-YL)HEXANOIC ACID CHEMBL135287
Type:
Small organic molecule
Emp. Form.:
C17H18O4
Mol. Mass.:
286.3224
SMILES:
Cc1c(O)c2ccccc2c(O)c1C=CCCCC(O)=O
: