Target
Cytochrome P450 26A1
Ligand
BDBM50158411
Substrate
Meas. Tech.
ChEMBL_430394 (CHEMBL916378)
IC50
24±n/a nM
Citation
 Patel, JBHuynh, CKHandratta, VDGediya, LKBrodie, AMGoloubeva, OGClement, OONanne, IPSoprano, DRNjar, VC Novel retinoic acid metabolism blocking agents endowed with multiple biological activities are efficient growth inhibitors of human breast and prostate cancer cells in vitro and a human breast tumor xenograft in nude mice. J Med Chem 47:6716-29 (2004)  
Target
Name:
Cytochrome P450 26A1
Synonyms:
CP26A_HUMAN CYP26A1 Cytochrome P450 26A1 P450RAI1 | Retinoic acid 4-hydroxylase
Type:
Enzyme
Mol. Mass.:
56216.16
Organism:
Homo sapiens (Human)
Description:
O43174
Residue:
497
  
Inhibitor
Name:
BDBM50158411
Synonyms:
(2E,4E,6E,8E)-9-(3-Imidazol-1-yl-2,6,6-trimethyl-cyclohex-1-enyl)-3,7-dimethyl-nona-2,4,6,8-tetraenoic acid (4-hydroxy-phenyl)-amide 9-(3-(1H-imidazol-1-yl)-2,6,6-trimethylcyclohex-1-enyl)-N-(4-hydroxyphenyl)-3,7-dimethylnona-2,4,6,8-tetraenamide | CHEMBL190837
Type:
Small organic molecule
Emp. Form.:
C29H35N3O2
Mol. Mass.:
457.6071
SMILES:
C\C(\C=C\C1=C(C)C(CCC1(C)C)n1ccnc1)=C/C=C/C(/C)=C/C(=O)Nc1ccc(O)cc1
: