Target
Cytochrome P450 26A1
Ligand
BDBM50158414
Substrate
Meas. Tech.
ChEMBL_430395 (CHEMBL916379)
IC50
800±n/a nM
Citation
 Patel, JBHuynh, CKHandratta, VDGediya, LKBrodie, AMGoloubeva, OGClement, OONanne, IPSoprano, DRNjar, VC Novel retinoic acid metabolism blocking agents endowed with multiple biological activities are efficient growth inhibitors of human breast and prostate cancer cells in vitro and a human breast tumor xenograft in nude mice. J Med Chem 47:6716-29 (2004)  
Target
Name:
Cytochrome P450 26A1
Synonyms:
CP26A_HUMAN CYP26A1 Cytochrome P450 26A1 P450RAI1 | Retinoic acid 4-hydroxylase
Type:
Enzyme
Mol. Mass.:
56216.16
Organism:
Homo sapiens (Human)
Description:
O43174
Residue:
497
  
Inhibitor
Name:
BDBM50158414
Synonyms:
(R,2E,4E,6E,8E)-methyl 9-(3-(1H-imidazol-1-yl)-2,6,6-trimethylcyclohex-1-enyl)-3,7-dimethylnona-2,4,6,8-tetraenoate CHEMBL225621
Type:
Small organic molecule
Emp. Form.:
C24H32N2O2
Mol. Mass.:
380.5231
SMILES:
COC(=O)\C=C(/C)\C=C\C=C(/C)\C=C\C1=C(C)[C@@H](CCC1(C)C)n1ccnc1
: