Target
Adenosine receptor A2a
Ligand
BDBM50159713
Substrate
Meas. Tech.
ChEMBL_303114 (CHEMBL829623)
Ki
1.1±n/a nM
Citation
 Yao, GHaque, SSha, LKumaravel, GWang, JEngber, TMWhalley, ETConlon, PRChang, HKiesman, WFPetter, RC Synthesis of alkyne derivatives of a novel triazolopyrazine as A(2A) adenosine receptor antagonists. Bioorg Med Chem Lett 15:511-5 (2005)  
Target
Name:
Adenosine receptor A2a
Synonyms:
AA2AR_RAT Adenosine A2 receptor Adenosine Receptors A2a (A2a) Adenosine receptors A2a Rat striatal adenosine A2a receptor
Type:
G Protein-Coupled Receptor (GPCR)
Mol. Mass.:
45015.65
Organism:
Rattus norvegicus (rat)
Description:
Rat A2A receptors expressed in CHO cells.
Residue:
410
  
Inhibitor
Name:
BDBM50159713
Synonyms:
4-(8-Amino-2-furan-2-yl-[1,2,4]triazolo[1,5-a]pyrazin-6-yl)-2-methyl-1-pyridin-4-yl-but-3-yn-2-ol CHEMBL359463
Type:
Small organic molecule
Emp. Form.:
C19H16N6O2
Mol. Mass.:
360.3693
SMILES:
CC(O)(Cc1ccncc1)C#Cc1cn2nc(nc2c(N)n1)-c1ccco1
: