Target
Carbonic anhydrase 4
Ligand
BDBM50159797
Substrate
Meas. Tech.
ChEMBL_302623 (CHEMBL838820)
Ki
2800±n/a nM
Citation
 Innocenti, AVullo, DScozzafava, ACasey, JRSupuran, C Carbonic anhydrase inhibitors. Interaction of isozymes I, II, IV, V, and IX with carboxylates. Bioorg Med Chem Lett 15:573-8 (2005)  
Target
Name:
Carbonic anhydrase 4
Synonyms:
CA-IV CAH4_HUMAN Carbonic anhydrase Carbonic anhydrase IV (CA IV)
Type:
Enzyme
Mol. Mass.:
35037.98
Organism:
Homo sapiens (Human)
Description:
P22748
Residue:
312
  
Inhibitor
Name:
BDBM50159797
Synonyms:
CHEMBL359504 sodium malonate
Type:
Small organic molecule
Emp. Form.:
C3H2O4
Mol. Mass.:
102.0467
SMILES:
[O-]C(=O)CC([O-])=O
: