Target
Carbonic anhydrase 9
Ligand
BDBM92494
Substrate
Meas. Tech.
ChEMBL_302624 (CHEMBL838821)
Ki
4930000.0±n/a nM
Citation
 Innocenti, AVullo, DScozzafava, ACasey, JRSupuran, C Carbonic anhydrase inhibitors. Interaction of isozymes I, II, IV, V, and IX with carboxylates. Bioorg Med Chem Lett 15:573-8 (2005)  
Target
Name:
Carbonic anhydrase 9
Synonyms:
CA-IX CAH9_HUMAN Carbonic anhydrase 9 (CA IX) Carbonic anhydrase 9 precursor Carbonic anhydrase IX (CAIX) Carbonic anhydrases; II & IX MN RCC-associated antigen G250
Type:
Enzyme
Mol. Mass.:
49669.03
Organism:
Homo sapiens (Human)
Description:
Catalytic domain of human cloned isozyme was used in the assay
Residue:
459
  
Inhibitor
Name:
BDBM92494
Synonyms:
Citrate | SODIUM CITRATE
Type:
Small organic molecule
Emp. Form.:
C6H5O7
Mol. Mass.:
189.1013
SMILES:
OC(CC([O-])=O)(CC([O-])=O)C([O-])=O
: