Target
5-hydroxytryptamine receptor 7
Ligand
BDBM50150686
Substrate
Meas. Tech.
ChEMBL_303384 (CHEMBL839701)
Ki
6.44±n/a nM
Citation
 Holmberg, PTedenborg, LRosqvist, SJohansson, AM Novel 3-aminochromans as potential pharmacological tools for the serotonin 5-HT(7) receptor. Bioorg Med Chem Lett 15:747-50 (2005)  
Target
Name:
5-hydroxytryptamine receptor 7
Synonyms:
5-HT-7 5-HT7 5-HT7S 5-hydroxytryptamine receptor 7 5HT7R_RAT GPRFO Serotonin (5-HT) receptor | Serotonin Receptor 7
Type:
G Protein-Coupled Receptor (GPCR)
Mol. Mass.:
49852.62
Organism:
Rattus norvegicus (rat)
Description:
Rat cloned 5-HT7R.
Residue:
448
  
Inhibitor
Name:
BDBM50150686
Synonyms:
CHEMBL182792 | [(R)-8-(2,6-Dimethoxy-phenyl)-chroman-3-yl]-dipropyl-amine
Type:
Small organic molecule
Emp. Form.:
C23H31NO3
Mol. Mass.:
369.4971
SMILES:
CCCN(CCC)[C@H]1COc2c(C1)cccc2-c1c(OC)cccc1OC
: