Target
3-hydroxy-3-methylglutaryl-coenzyme A reductase
Ligand
BDBM18372
Substrate
Meas. Tech.
ChEMBL_302634 (CHEMBL839925)
Ki
0.9±n/a nM
Citation
 Medina-Franco, JLLópez-Vallejo, FRodríguez-Morales, SCastillo, RChamorro, GTamariz, J Molecular docking of the highly hypolipidemic agent alpha-asarone with the catalytic portion of HMG-CoA reductase. Bioorg Med Chem Lett 15:989-94 (2005)  
Target
Name:
3-hydroxy-3-methylglutaryl-coenzyme A reductase
Synonyms:
3-hydroxy-3-methylglutaryl-coenzyme A (HMG-CoA) reductase HMDH_HUMAN HMG-CoA reductase (HMGR) | HMGCR
Type:
Enzyme
Mol. Mass.:
97477.10
Organism:
Homo sapiens (Human)
Description:
P04035
Residue:
888
  
Inhibitor
Name:
BDBM18372
Synonyms:
(3R,5S,6E)-7-[4-(4-fluorophenyl)-2-(N-methylmethanesulfonamido)-6-(propan-2-yl)pyrimidin-5-yl]-3,5-dihydroxyhept-6-enoic acid Ros US9102656, Rosuvastatin | ZD4522
Type:
Small organic molecule
Emp. Form.:
C22H28FN3O6S
Mol. Mass.:
481.538
SMILES:
CC(C)c1nc(nc(-c2ccc(F)cc2)c1\C=C\[C@@H](O)C[C@@H](O)CC(O)=O)N(C)S(C)(=O)=O
: