Target
Histamine H1 receptor
Ligand
BDBM22890
Substrate
Meas. Tech.
ChEMBL_302917 (CHEMBL830377)
Ki
5.89±n/a nM
Citation
 Lewis, TABayless, LDiPesa, AJEckman, JBGillard, MLibertine, LScannell, RTWypij, DMYoung, MA 5-Lipoxygenase inhibition by N-hydroxycarbamates in dual-function compounds. Bioorg Med Chem Lett 15:1083-5 (2005)  
Target
Name:
Histamine H1 receptor
Synonyms:
H1R HISTAMINE H1 HRH1_HUMAN
Type:
G Protein-Coupled Receptor (GPCR)
Mol. Mass.:
55808.72
Organism:
Homo sapiens (Human)
Description:
Cell pellets from SK-N-MC cells transfected with human H1 receptor were used in binding assay.
Residue:
487
  
Inhibitor
Name:
BDBM22890
Synonyms:
2-(2-{4-[(4-chlorophenyl)(phenyl)methyl]piperazin-1-yl}ethoxy)acetic acid Cetirizine | Levocetirizine
Type:
Small organic molecule
Emp. Form.:
C21H25ClN2O3
Mol. Mass.:
388.888
SMILES:
OC(=O)COCCN1CCN(CC1)C(c1ccccc1)c1ccc(Cl)cc1
: