Target
D(3) dopamine receptor
Ligand
BDBM50161239
Substrate
Meas. Tech.
ChEMBL_302737 (CHEMBL838684)
Ki
1±n/a nM
Citation
 Grundt, PCarlson, EECao, JBennett, CJMcElveen, ETaylor, MLuedtke, RRNewman, AH Novel heterocyclic trans olefin analogues of N-{4-[4-(2,3-dichlorophenyl)piperazin-1-yl]butyl}arylcarboxamides as selective probes with high affinity for the dopamine D3 receptor. J Med Chem 48:839-48 (2005)  
Target
Name:
D(3) dopamine receptor
Synonyms:
DOPAMINE D3 DRD3_HUMAN Dopamine D3 receptor (D3) Dopamine receptor Dopamine receptor D3
Type:
Mol. Mass.:
44243.43
Organism:
Homo sapiens (Human)
Description:
Residue:
400
  
Inhibitor
Name:
BDBM50161239
Synonyms:
CHEMBL366900 | N-{4-[4-(2,3-Dichloro-phenyl)-piperazin-1-yl]-but-2-enyl}-4-fluoro-benzamide
Type:
Small organic molecule
Emp. Form.:
C21H22Cl2FN3O
Mol. Mass.:
422.323
SMILES:
Fc1ccc(cc1)C(=O)NC\C=C\CN1CCN(CC1)c1cccc(Cl)c1Cl
: