Target
D(3) dopamine receptor
Ligand
BDBM50161234
Substrate
Meas. Tech.
ChEMBL_302737 (CHEMBL838684)
Ki
0.9±n/a nM
Citation
 Grundt, PCarlson, EECao, JBennett, CJMcElveen, ETaylor, MLuedtke, RRNewman, AH Novel heterocyclic trans olefin analogues of N-{4-[4-(2,3-dichlorophenyl)piperazin-1-yl]butyl}arylcarboxamides as selective probes with high affinity for the dopamine D3 receptor. J Med Chem 48:839-48 (2005)  
Target
Name:
D(3) dopamine receptor
Synonyms:
DOPAMINE D3 DRD3_HUMAN Dopamine D3 receptor (D3) Dopamine receptor Dopamine receptor D3
Type:
Mol. Mass.:
44243.43
Organism:
Homo sapiens (Human)
Description:
Residue:
400
  
Inhibitor
Name:
BDBM50161234
Synonyms:
CHEMBL425143 | N-{4-[4-(2,3-Dichloro-phenyl)-piperazin-1-yl]-but-2-enyl}-4-pyridin-4-yl-benzamide
Type:
Small organic molecule
Emp. Form.:
C26H26Cl2N4O
Mol. Mass.:
481.417
SMILES:
Clc1cccc(N2CCN(C\C=C\CNC(=O)c3ccc(cc3)-c3ccncc3)CC2)c1Cl
: