Target
Fatty-acid amide hydrolase 1
Ligand
BDBM50161515
Substrate
Meas. Tech.
ChEMBL_303730 (CHEMBL829636)
Ki
3200±n/a nM
Citation
 Leung, DDu, WHardouin, CCheng, HHwang, ICravatt, BFBoger, DL Discovery of an exceptionally potent and selective class of fatty acid amide hydrolase inhibitors enlisting proteome-wide selectivity screening: concurrent optimization of enzyme inhibitor potency and selectivity. Bioorg Med Chem Lett 15:1423-8 (2005)  
Target
Name:
Fatty-acid amide hydrolase 1
Synonyms:
Anandamide amidohydrolase FAAH1_MOUSE Faah1 Fatty-acid amide hydrolase (FAAH) Oleamide hydrolase 1
Type:
Hydrolase; single-pass membrane protein; homodimer
Mol. Mass.:
63227.28
Organism:
Mus musculus (mouse)
Description:
Mouse brain membranes were used in the assay.
Residue:
579
  
Inhibitor
Name:
BDBM50161515
Synonyms:
8-phenyl-1-(5-(pyridin-2-yl)-1,3,4-oxadiazol-2-yl)octan-1-one | CHEMBL182206
Type:
Small organic molecule
Emp. Form.:
C21H23N3O2
Mol. Mass.:
349.4262
SMILES:
O=C(CCCCCCCc1ccccc1)c1nnc(o1)-c1ccccn1
: