Target
Liver carboxylesterase 1
Ligand
BDBM50073985
Substrate
Meas. Tech.
ChEMBL_305509 (CHEMBL831110)
IC50
10±n/a nM
Citation
 Boger, DLMiyauchi, HDu, WHardouin, CFecik, RACheng, HHwang, IHedrick, MPLeung, DAcevedo, OGuimarães, CRJorgensen, WLCravatt, BF Discovery of a potent, selective, and efficacious class of reversible alpha-ketoheterocycle inhibitors of fatty acid amide hydrolase effective as analgesics. J Med Chem 48:1849-56 (2005)  
Target
Name:
Liver carboxylesterase 1
Synonyms:
Acyl coenzyme A:cholesterol acyltransferase CES1 EST1_HUMAN Serine hydrolase (CES1)
Type:
Protein
Mol. Mass.:
62520.83
Organism:
Homo sapiens (Human)
Description:
Residue:
567
  
Inhibitor
Name:
BDBM50073985
Synonyms:
1,1,1-Trifluoro-undecan-2-one CHEMBL90258
Type:
Small organic molecule
Emp. Form.:
C11H19F3O
Mol. Mass.:
224.2632
SMILES:
CCCCCCCCCC(=O)C(F)(F)F
: