Target
Alpha-2A adrenergic receptor
Ligand
BDBM50163479
Substrate
Meas. Tech.
ChEMBL_302772 (CHEMBL838835)
Ki
0.100000±n/a nM
Citation
 Andrés, JIAlcázar, JAlonso, JMAlvarez, RMBakker, MHBiesmans, ICid, JMDe Lucas, AIFernández, JFont, LMHens, KAIturrino, LLenaerts, IMartínez, SMegens, AAPastor, JVermote, PCSteckler, T Discovery of a new series of centrally active tricyclic isoxazoles combining serotonin (5-HT) reuptake inhibition with alpha2-adrenoceptor blocking activity. J Med Chem 48:2054-71 (2005)  
Target
Name:
Alpha-2A adrenergic receptor
Synonyms:
ADA2A_HUMAN ADRA2R Adrenergic alpha2A Alpha-2 adrenergic receptor subtype C10 Alpha-2A adrenoreceptor alpha-2A adrenergic receptor [Homo sapiens]
Type:
Enzyme
Mol. Mass.:
48979.91
Organism:
Homo sapiens (Human)
Description:
P08913
Residue:
450
  
Inhibitor
Name:
BDBM50163479
Synonyms:
CHEMBL176261 | Dimethyl-(2-{(3R,3aS)-3-[4-((E)-2-methyl-3-phenyl-allyl)-piperazin-1-ylmethyl]-3a,4-dihydro-3H-chromeno[4,3-c]isoxazol-7-yloxy}-ethyl)-amine
Type:
Small organic molecule
Emp. Form.:
C29H38N4O3
Mol. Mass.:
490.637
SMILES:
CN(C)CCOc1ccc2C3=NO[C@@H](CN4CCN(C\C(C)=C\c5ccccc5)CC4)[C@@H]3COc2c1
: