Target
D(2) dopamine receptor
Ligand
BDBM50116766
Substrate
Meas. Tech.
ChEMBL_303214 (CHEMBL829839)
Ki
21±n/a nM
Citation
 Boeckler, FOhnmacht, ULehmann, TUtz, WHübner, HGmeiner, P CoMFA and CoMSIA investigations revealing novel insights into the binding modes of dopamine D3 receptor agonists. J Med Chem 48:2493-508 (2005)  
Target
Name:
D(2) dopamine receptor
Synonyms:
D(2) dopamine receptor DOPAMINE D2 Long DRD2 Dopamine D2 receptor Dopamine D2 receptor (D2R) Dopamine2-like | d2
Type:
Cell-surface receptors
Mol. Mass.:
50647.10
Organism:
Homo sapiens (Human)
Description:
P14416
Residue:
443
  
Inhibitor
Name:
BDBM50116766
Synonyms:
(-)-Pramipexole 2,6-Benzothiazolediamine, 4,5,6,7-tetrahydro-N(sup 6)-propyl-, (S)- PRAMIPEXOLE | cid_119570
Type:
Small organic molecule
Emp. Form.:
C10H17N3S
Mol. Mass.:
211.327
SMILES:
CCCN[C@H]1CCc2nc(N)sc2C1
: