Target
Melanocortin receptor 5
Ligand
BDBM50165932
Substrate
Meas. Tech.
ChEMBL_303608 (CHEMBL829697)
Ki
0.840000±n/a nM
Citation
 Mayer, JPHsiung, HMFlora, DBEdwards, PSmith, DPZhang, XYGadski, RAHeiman, MLHertel, JLEmmerson, PJHusain, SO'brien, TPKahl, SDSmiley, DLZhang, LDimarchi, RDYan, LZ Discovery of a beta-MSH-derived MC-4R selective agonist. J Med Chem 48:3095-8 (2005)  
Target
Name:
Melanocortin receptor 5
Synonyms:
MC-2 MC5R Melanocortin MC5 Melanocortin receptor 5 | Melanocortin receptor 5 (MC5R)
Type:
Enzyme
Mol. Mass.:
36612.92
Organism:
Homo sapiens (Human)
Description:
P33032
Residue:
325
  
Inhibitor
Name:
BDBM50165932
Synonyms:
Ac-YRMEHdFRWG-NH2 | CHEMBL266879
Type:
Small organic molecule
Emp. Form.:
C61H83N19O13S
Mol. Mass.:
1322.496
SMILES:
CSCC[C@H](NC(=O)[C@H](CCCNC(N)=N)NC(=O)[C@H](Cc1ccc(O)cc1)NC(C)=O)C(=O)N[C@@H](CCC(O)=O)C(=O)N[C@@H](Cc1cnc[nH]1)C(=O)N[C@H](Cc1ccccc1)C(=O)N[C@@H](CCCNC(N)=N)C(=O)N[C@@H](Cc1c[nH]c2ccccc12)C(=O)NCC(N)=O
: