Target
Dipeptidyl peptidase 4
Ligand
BDBM50166318
Substrate
Meas. Tech.
ChEMBL_305067 (CHEMBL832699)
IC50
0.15±n/a nM
Citation
 Sakashita, HKitajima, HNakamura, MAkahoshi, FHayashi, Y 1-((S)-gamma-substituted prolyl)-(S)-2-cyanopyrrolidine as a novel series of highly potent DPP-IV inhibitors. Bioorg Med Chem Lett 15:2441-5 (2005)  
Target
Name:
Dipeptidyl peptidase 4
Synonyms:
Bile canaliculus domain-specific membrane glycoprotein Cd26 DPP4_RAT Dipeptidyl peptidase 4 Dipeptidyl peptidase 4 60 kDa soluble form Dipeptidyl peptidase 4 soluble form Dipeptidyl peptidase IV 60 kDa soluble form Dipeptidyl peptidase IV soluble form GP110 glycoprotein | T-cell activation antigen CD26
Type:
Enzyme
Mol. Mass.:
88084.94
Organism:
Rattus norvegicus (rat)
Description:
Residue:
767
  
Inhibitor
Name:
BDBM50166318
Synonyms:
(S)-1-[(2S,4S)-4-(3-Chloro-4-cyano-phenylamino)-pyrrolidine-2-carbonyl]-pyrrolidine-2-carbonitrile | CHEMBL194717
Type:
Small organic molecule
Emp. Form.:
C17H18ClN5O
Mol. Mass.:
343.811
SMILES:
Clc1cc(N[C@@H]2CN[C@@H](C2)C(=O)N2CCC[C@H]2C#N)ccc1C#N
: