Target
Alpha-2A adrenergic receptor
Ligand
BDBM50166564
Substrate
Meas. Tech.
ChEMBL_306656 (CHEMBL831429)
IC50
86±n/a nM
Citation
 Kanuma, KOmodera, KNishiguchi, MFunakoshi, TChaki, SSemple, GTran, TAKramer, BHsu, DCasper, MThomsen, BBeeley, NSekiguchi, Y Discovery of 4-(dimethylamino)quinazolines as potent and selective antagonists for the melanin-concentrating hormone receptor 1. Bioorg Med Chem Lett 15:2565-9 (2005)  
Target
Name:
Alpha-2A adrenergic receptor
Synonyms:
ADA2A_HUMAN ADRA2R Adrenergic alpha2A Alpha-2 adrenergic receptor subtype C10 Alpha-2A adrenoreceptor alpha-2A adrenergic receptor [Homo sapiens]
Type:
Enzyme
Mol. Mass.:
48979.91
Organism:
Homo sapiens (Human)
Description:
P08913
Residue:
450
  
Inhibitor
Name:
BDBM50166564
Synonyms:
CHEMBL195123 | N-{4-[(4-Dimethylamino-quinazolin-2-ylamino)-methyl]-cyclohexylmethyl}-methanesulfonamide
Type:
Small organic molecule
Emp. Form.:
C19H29N5O2S
Mol. Mass.:
391.531
SMILES:
CN(C)c1nc(NCC2CCC(CNS(C)(=O)=O)CC2)nc2ccccc12
: