Target
Cathepsin K
Ligand
BDBM50167289
Substrate
Meas. Tech.
ChEMBL_303352 (CHEMBL839667)
Ki
0.009000±n/a nM
Citation
 Barrett, DGDeaton, DNHassell, AMMcFadyen, RBMiller, ABMiller, LRPayne, JAShewchuk, LMWillard, DHWright, LL Acyclic cyanamide-based inhibitors of cathepsin K. Bioorg Med Chem Lett 15:3039-43 (2005)  
Target
Name:
Cathepsin K
Synonyms:
CATK_HUMAN CTSO Cathepsin O Cathepsin X
Type:
Enzyme
Mol. Mass.:
36975.68
Organism:
Homo sapiens (Human)
Description:
P43235
Residue:
329
  
Inhibitor
Name:
BDBM50167289
Synonyms:
(1S)-2-cyclohexyl-1-methylethyl 2-cyano-2-methylhydrazinecarboxylate | CHEMBL190121
Type:
Small organic molecule
Emp. Form.:
C12H21N3O2
Mol. Mass.:
239.314
SMILES:
C[C@@H](CC1CCCCC1)OC(=O)NN(C)C#N
: