Target
Replicase polyprotein 1a
Ligand
BDBM50167308
Substrate
Meas. Tech.
ChEMBL_305843 (CHEMBL829584)
IC50
12570±n/a nM
Citation
 Chen, LRWang, YCLin, YWChou, SYChen, SFLiu, LTWu, YTKuo, CJChen, TSJuang, SH Synthesis and evaluation of isatin derivatives as effective SARS coronavirus 3CL protease inhibitors. Bioorg Med Chem Lett 15:3058-62 (2005)  
Target
Name:
Replicase polyprotein 1a
Synonyms:
3C-like proteinase 3CLp Growth factor-like peptide Non-structural protein 1 Non-structural protein 11 Non-structural protein 3 Non-structural protein 6 Non-structural protein 8 ORF1a polyprotein PL2-PRO Papain-like proteinase Replicase polyprotein 1a SARS coronavirus 3C-like proteinase nsp1 nsp11 nsp3 nsp5 nsp7 nsp9 pp1a
Type:
Enzyme
Mol. Mass.:
486353.36
Organism:
Human SARS coronavirus (SARS-CoV)
Description:
P0C6U8
Residue:
4382
  
Inhibitor
Name:
BDBM50167308
Synonyms:
5-(5-Iodo-2,3-dioxo-2,3-dihydro-indol-1-ylmethyl)-thiophene-2-carboxylic acid (4-chloro-phenyl)-amide acs.jmedchem.1c00409_ST.539
Type:
Small organic molecule
Emp. Form.:
C20H12ClIN2O3S
Mol. Mass.:
522.743
SMILES:
Clc1ccc(NC(=O)c2ccc(CN3C(=O)C(=O)c4cc(I)ccc34)s2)cc1
: