Target
Nociceptin receptor
Ligand
BDBM50146344
Substrate
Meas. Tech.
ChEMBL_302942 (CHEMBL841777)
Ki
88±n/a nM
Citation
 Bartolomé, JMAlcudia, AAndrés, JICid, JMGarcía, MMegens, AToledo, MATrabanco, AA Novel 2-N,N-dimethylaminomethyl-2,3,3a,12b-tetrahydrodibenzo[b,f]furo[2,3-d]oxepin derivatives displaying combined norepinephrine reuptake inhibition and 5-HT2A/2C receptor antagonism. Bioorg Med Chem Lett 15:2898-901 (2005)  
Target
Name:
Nociceptin receptor
Synonyms:
Nociceptin/Orphanin FQ, NOP receptor OPRX_RAT Oprl | Oprl1
Type:
Enzyme Catalytic Domain
Mol. Mass.:
40531.08
Organism:
RAT
Description:
Nociceptin/Orphanin FQ, NOP receptor 0 RAT::P35370
Residue:
367
  
Inhibitor
Name:
BDBM50146344
Synonyms:
CHEMBL330713 | Dimethyl-[(3aS,12bS)-1-(2,3,3a,12b-tetrahydro-1,8-dioxa-dibenzo[e,h]azulen-2-yl)methyl]-amine
Type:
Small organic molecule
Emp. Form.:
C19H21NO2
Mol. Mass.:
295.3755
SMILES:
CN(C)CC1C[C@@H]2[C@H](O1)c1ccccc1Oc1ccccc21
: