Target
Prostaglandin G/H synthase 1
Ligand
BDBM50072064
Substrate
Meas. Tech.
ChEMBL_306226 (CHEMBL831134)
IC50
>200000±n/a nM
Citation
 Khanapure, SPAugustyniak, MEEarl, RAGarvey, DSLetts, LGMartino, AMMurty, MGSchwalb, DJShumway, MJTrocha, AMYoung, DVZemtseva, ISJanero, DR 3-[4-(methylsulfonyl)phenyl]-5-(trifluoromethyl)(2-pyridyl) phenyl ketone as a potent and orally active cyclooxygenase-2 selective inhibitor: synthesis and biological evaluation. J Med Chem 48:3930-4 (2005)  
Target
Name:
Prostaglandin G/H synthase 1
Synonyms:
COX-1 Cyclooxygenase Cyclooxygenase-1 (COX-1) PTGS1 | Prostaglandin G/H synthase (cyclooxygenase)
Type:
Enzyme
Mol. Mass.:
68692.62
Organism:
Homo sapiens (Human)
Description:
P23219
Residue:
599
  
Inhibitor
Name:
BDBM50072064
Synonyms:
5-Chloro-3-(4-methanesulfonyl-phenyl)-6''-methyl-[2,3'']bipyridinyl 5-chloro-2-(6-methylpyridin-3-yl)-3-(4-(methylsulfonyl)phenyl)pyridine CHEMBL416146 | ETORICOXIB
Type:
Small organic molecule
Emp. Form.:
C18H15ClN2O2S
Mol. Mass.:
358.842
SMILES:
Cc1ccc(cn1)-c1ncc(Cl)cc1-c1ccc(cc1)S(C)(=O)=O
: