Target
Adenosine receptor A2a
Ligand
BDBM50169328
Substrate
Meas. Tech.
ChEMBL_302654 (CHEMBL839943)
Ki
1.1±n/a nM
Citation
 Matasi, JJCaldwell, JPZhang, HFawzi, ACohen-Williams, MEVarty, GBTulshian, DB 2-(2-Furanyl)-7-phenyl[1,2,4]triazolo[1,5-c]pyrimidin-5-amine analogs: highly potent, orally active, adenosine A2A antagonists. Part 1. Bioorg Med Chem Lett 15:3670-4 (2005)  
Target
Name:
Adenosine receptor A2a
Synonyms:
AA2AR_RAT Adenosine A2 receptor Adenosine Receptors A2a (A2a) Adenosine receptors A2a Rat striatal adenosine A2a receptor
Type:
G Protein-Coupled Receptor (GPCR)
Mol. Mass.:
45015.65
Organism:
Rattus norvegicus (rat)
Description:
Rat A2A receptors expressed in CHO cells.
Residue:
410
  
Inhibitor
Name:
BDBM50169328
Synonyms:
5-{4-[3-(5-Amino-2-furan-2-yl-[1,2,4]triazolo[1,5-c]pyrimidin-7-yl)-benzyl]-piperazin-1-yl}-2-(2-methoxy-ethoxy)-benzonitrile | CHEMBL180211
Type:
Small organic molecule
Emp. Form.:
C30H30N8O3
Mol. Mass.:
550.611
SMILES:
COCCOc1ccc(cc1C#N)N1CCN(Cc2cccc(c2)-c2cc3nc(nn3c(N)n2)-c2ccco2)CC1
: