Target
3-dehydroquinate dehydratase
Ligand
BDBM50170808
Substrate
Meas. Tech.
ChEMBL_303647 (CHEMBL828995)
pH
8.2±n/a
Ki
1500±n/a nM
Comments
extracted
Citation
 Sánchez-Sixto, CPrazeres, VFCastedo, LLamb, HHawkins, ARGonzález-Bello, C Structure-based design, synthesis, and biological evaluation of inhibitors of Mycobacterium tuberculosis type II dehydroquinase. J Med Chem 48:4871-81 (2005)  
Target
Name:
3-dehydroquinate dehydratase
Synonyms:
AROQ_MYCTU aroQ
Type:
PROTEIN
Mol. Mass.:
15786.25
Organism:
Mycobacterium tuberculosis
Description:
ChEMBL_766423
Residue:
147
  
Inhibitor
Name:
BDBM50170808
Synonyms:
(1R,4R,5R)-1,4,5-Trihydroxy-3-phenyl-cyclohex-2-enecarboxylic acid | CHEMBL361695
Type:
Small organic molecule
Emp. Form.:
C13H14O5
Mol. Mass.:
250.2473
SMILES:
O[C@@H]1C[C@@](O)(C=C([C@H]1O)c1ccccc1)C(O)=O
: