Target
3-dehydroquinate dehydratase
Ligand
BDBM50170810
Substrate
Meas. Tech.
ChEMBL_303647 (CHEMBL828995)
pH
8.2±n/a
Ki
20000±n/a nM
Comments
extracted
Citation
 Sánchez-Sixto, CPrazeres, VFCastedo, LLamb, HHawkins, ARGonzález-Bello, C Structure-based design, synthesis, and biological evaluation of inhibitors of Mycobacterium tuberculosis type II dehydroquinase. J Med Chem 48:4871-81 (2005)  
Target
Name:
3-dehydroquinate dehydratase
Synonyms:
AROQ_MYCTU aroQ
Type:
PROTEIN
Mol. Mass.:
15786.25
Organism:
Mycobacterium tuberculosis
Description:
ChEMBL_766423
Residue:
147
  
Inhibitor
Name:
BDBM50170810
Synonyms:
(1S,3R,4R)-1,3,4-Trihydroxy-5-hydroxyimino-cyclohexanecarboxylic acid CHEMBL363381
Type:
Small organic molecule
Emp. Form.:
C7H11NO6
Mol. Mass.:
205.1653
SMILES:
ONC1C[C@](O)(CC(=O)[C@@H]1O)C(O)=O
: