Target
Glutathione reductase
Ligand
BDBM50171439
Substrate
Meas. Tech.
ChEMBL_305846 (CHEMBL829587)
pH
7.4±n/a
IC50
515000.0±n/a nM
Comments
extracted
Citation
 Seefeldt, TDwivedi, CPeitz, GHerman, JCarlson, LZhang, ZGuan, X 2-Acetylamino-3-[4-(2-acetylamino-2-carboxyethylsulfanylcarbonylamino)- phenylcarbamoylsulfanyl]propionic acid and its derivatives as a novel class of glutathione reductase inhibitors. J Med Chem 48:5224-31 (2005)  
Target
Name:
Glutathione reductase
Synonyms:
GLR1 | GSHR_YEAST
Type:
PROTEIN
Mol. Mass.:
53448.83
Organism:
Saccharomyces cerevisiae
Description:
ChEMBL_700053
Residue:
483
  
Inhibitor
Name:
BDBM50171439
Synonyms:
2-Acetylamino-3-[4-(2-acetylamino-2-carboxy-ethylsulfanylcarbonylamino)-butylcarbamoylsulfanyl]-propionic acid | CHEMBL191549
Type:
Small organic molecule
Emp. Form.:
C16H26N4O8S2
Mol. Mass.:
466.53
SMILES:
CC(=O)NC(CSC(=O)NCCCCNC(=O)SCC(NC(C)=O)C(O)=O)C(O)=O
: