Target
1-acyl-sn-glycerol-3-phosphate acyltransferase beta
Ligand
BDBM50172949
Substrate
Meas. Tech.
ChEMBL_321473 (CHEMBL880414)
IC50
140±n/a nM
Citation
 Hong, FHollenback, DSinger, JWKlein, P Diamino-C,N-diarylpyridine positional isomers as inhibitors of lysophosphatidic acid acyltransferase-beta. Bioorg Med Chem Lett 15:4703-7 (2005)  
Target
Name:
1-acyl-sn-glycerol-3-phosphate acyltransferase beta
Synonyms:
1-acylglycerol-3-phosphate O-acyltransferase beta PLCB_HUMAN
Type:
PROTEIN
Mol. Mass.:
30924.09
Organism:
Homo sapiens (Human)
Description:
ChEMBL_321473
Residue:
278
  
Inhibitor
Name:
BDBM50172949
Synonyms:
6-(5-Chloro-2-ethoxy-phenyl)-N-(4-chloro-phenyl)-[1,3,5]triazine-2,4-diamine | CHEMBL193589
Type:
Small organic molecule
Emp. Form.:
C17H15Cl2N5O
Mol. Mass.:
376.24
SMILES:
CCOc1ccc(Cl)cc1-c1nc(N)nc(Nc2ccc(Cl)cc2)n1
: